Reaction Details
TargetMuscarinic acetylcholine receptor M5
LigandBDBM50342538
Substrate/Competitorn/a
Meas. Tech.ChEMBL_744883 (CHEMBL1772904)
IC50 300±n/a nM
Citation Andrews, MDFish, PVBlagg, JBrabham, TKBrennan, PEBridgeland, ABrown, ADBungay, PJConlon, KMEdmunds, NJaf Forselles, KGibbons, CPGreen, MPHanton, GHolbrook, MJessiman, ASMcIntosh, KMcMurray, GNichols, CLRoot, JAStorer, RISutton, MRWard, RVWestbrook, DWhitlock, GA Pyrimido[4,5-d]azepines as potent and selective 5-HT2C receptor agonists: design, synthesis, and evaluation of PF-3246799 as a treatment for urinary incontinence. Bioorg Med Chem Lett21:2715-20 (2011) 
 
Muscarinic acetylcholine receptor M5
Name:Muscarinic acetylcholine receptor M5
Type:PROTEIN
Mol. Mass.:60102.35
Organism:Homo sapiens (Human)
Description:ChEMBL_1517990
Residue:532
BDBM50342538
NameBDBM50342538
Synonyms:2-benzyl-6,7,8,9-tetrahydro-5H-pyrimido[5,4-d]azepine | CHEMBL1770373
TypeSmall organic molecule
Emp. Form.C15H17N3
Mol. Mass.239.3156
SMILESC(c1ccccc1)c1ncc2CCNCCc2n1