Reaction Details
Target5-hydroxytryptamine receptor 2C
LigandBDBM50161646
Substrate/Competitorn/a
Meas. Tech.ChEMBL_744732 (CHEMBL1772753)
Ki 167±n/a nM
Citation Andrews, MDFish, PVBlagg, JBrabham, TKBrennan, PEBridgeland, ABrown, ADBungay, PJConlon, KMEdmunds, NJaf Forselles, KGibbons, CPGreen, MPHanton, GHolbrook, MJessiman, ASMcIntosh, KMcMurray, GNichols, CLRoot, JAStorer, RISutton, MRWard, RVWestbrook, DWhitlock, GA Pyrimido[4,5-d]azepines as potent and selective 5-HT2C receptor agonists: design, synthesis, and evaluation of PF-3246799 as a treatment for urinary incontinence. Bioorg Med Chem Lett21:2715-20 (2011) 
 
5-hydroxytryptamine receptor 2C
Name:5-hydroxytryptamine receptor 2C
Type:G Protein-Coupled Receptor (GPCR)
Mol. Mass.:51836.79
Organism:Homo sapiens (Human)
Description:P28335
Residue:458
BDBM50161646
NameBDBM50161646
Synonyms:(1R)-8-chloro-2,3,4,5-tetrahydro-1-methyl-1H-3-benzazepine CHEMBL360328 | LORCASERIN
TypeSmall organic molecule
Emp. Form.C11H14ClN
Mol. Mass.195.689
SMILESC[C@H]1CNCCc2ccc(Cl)cc12