Reaction Details
TargetCytochrome P450 2D6
LigandBDBM50342538
Substrate/Competitorn/a
Meas. Tech.ChEMBL_744801 (CHEMBL1772822)
IC50>30000±n/a nM
Citation Andrews, MDFish, PVBlagg, JBrabham, TKBrennan, PEBridgeland, ABrown, ADBungay, PJConlon, KMEdmunds, NJaf Forselles, KGibbons, CPGreen, MPHanton, GHolbrook, MJessiman, ASMcIntosh, KMcMurray, GNichols, CLRoot, JAStorer, RISutton, MRWard, RVWestbrook, DWhitlock, GA Pyrimido[4,5-d]azepines as potent and selective 5-HT2C receptor agonists: design, synthesis, and evaluation of PF-3246799 as a treatment for urinary incontinence. Bioorg Med Chem Lett21:2715-20 (2011) 
 
Cytochrome P450 2D6
Name:Cytochrome P450 2D6
Type:Protein
Mol. Mass.:55774.82
Organism:Homo sapiens (Human)
Description:P10635
Residue:497
BDBM50342538
NameBDBM50342538
Synonyms:2-benzyl-6,7,8,9-tetrahydro-5H-pyrimido[5,4-d]azepine | CHEMBL1770373
TypeSmall organic molecule
Emp. Form.C15H17N3
Mol. Mass.239.3156
SMILESC(c1ccccc1)c1ncc2CCNCCc2n1