Reaction Details
TargetBeta-2 adrenergic receptor
LigandBDBM50326547
Substrate/Competitorn/a
Meas. Tech.ChEMBL_745279 (CHEMBL1775311)
EC50 1.1±n/a nM
Citation Jones, LHBaldock, HBunnage, MEBurrows, JClarke, NCoghlan, MEntwistle, DFairman, DFeeder, NFulton, CHilton, LJames, KJones, RMKenyon, ASMarshall, SNewman, SDOsborne, RPatel, SSelby, MDStuart, EFTrevethick, MAWright, KNPrice, DA Inhalation by design: dual pharmacology β-2 agonists/M3 antagonists for the treatment of COPD. Bioorg Med Chem Lett21:2759-63 (2011) 
 
Beta-2 adrenergic receptor
Name:Beta-2 adrenergic receptor
Type:n/a
Mol. Mass.:46461.69
Organism:Homo sapiens (Human)
Description:P07550
Residue:413
BDBM50326547
NameBDBM50326547
Synonyms:CHEMBL230490 | N-(3,4-dichlorobenzyl)-2-(3-((R)-2-((R)-2-hydroxy-2-(4-hydroxy-3-(hydroxymethyl)phenyl)ethylamino)propyl)phenyl)acetamide
TypeSmall organic molecule
Emp. Form.C27H30Cl2N2O4
Mol. Mass.517.444
SMILESC[C@H](Cc1cccc(CC(=O)NCc2ccc(Cl)c(Cl)c2)c1)NC[C@H](O)c1ccc(O)c(CO)c1