Reaction Details
TargetMuscarinic acetylcholine receptor M3
LigandBDBM50343154
Substrate/Competitorn/a
Meas. Tech.ChEMBL_745281 (CHEMBL1775313)
Ki 0.397000±n/a nM
Citation Jones, LHBaldock, HBunnage, MEBurrows, JClarke, NCoghlan, MEntwistle, DFairman, DFeeder, NFulton, CHilton, LJames, KJones, RMKenyon, ASMarshall, SNewman, SDOsborne, RPatel, SSelby, MDStuart, EFTrevethick, MAWright, KNPrice, DA Inhalation by design: dual pharmacology β-2 agonists/M3 antagonists for the treatment of COPD. Bioorg Med Chem Lett21:2759-63 (2011) 
 
Muscarinic acetylcholine receptor M3
Name:Muscarinic acetylcholine receptor M3
Type:Enzyme
Mol. Mass.:66151.03
Organism:Homo sapiens (Human)
Description:P20309
Residue:590
BDBM50343154
NameBDBM50343154
Synonyms:2-(3-((R)-2-((R)-2-(3,5-dihydroxyphenyl)-2-hydroxyethylamino)propyl)phenyl)-N-(3-(3-((R)-3-(diisopropylamino)-1-phenylpropyl)-4-hydroxyphenyl)propyl)acetamide | CHEMBL1773198
TypeSmall organic molecule
Emp. Form.C43H57N3O5
Mol. Mass.695.9298
SMILESCC(C)N(CC[C@H](c1ccccc1)c1cc(CCCNC(=O)Cc2cccc(C[C@@H](C)NC[C@H](O)c3cc(O)cc(O)c3)c2)ccc1O)C(C)C