Reaction Details
TargetBotulinum neurotoxin type A
LigandBDBM50343187
Substrate/Competitorn/a
Meas. Tech.ChEMBL_745407 (CHEMBL1775563)
Ki 8100±n/a nM
Citation Opsenica, IBurnett, JCGussio, ROpsenica, DTodorovic, NLanteri, CASciotti, RJGettayacamin, MBasilico, NTaramelli, DNuss, JEWanner, LPanchal, RGSolaja, BABavari, S A chemotype that inhibits three unrelated pathogenic targets: the botulinum neurotoxin serotype A light chain, P. falciparum malaria, and the Ebola filovirus. J Med Chem54:1157-69 (2011) 
 
Botulinum neurotoxin type A
Name:Botulinum neurotoxin type A
Type:PROTEIN
Mol. Mass.:149450.01
Organism:Clostridium botulinum
Description:ChEMBL_1510137
Residue:1296
BDBM50343187
NameBDBM50343187
Synonyms:CHEMBL1773155 | N,N'-Bis(3-aminopropyl)-3,9-dimethylquino[8,7-h]quinoline-1,7-diamine Tetrahydrochloride
TypeSmall organic molecule
Emp. Form.C24H30N6
Mol. Mass.402.5352
SMILESCc1cc(NCCCN)c2ccc3c(ccc4c(NCCCN)cc(C)nc34)c2n1