Reaction Details
TargetKappa-type opioid receptor
LigandBDBM50343252
Substrate/Competitorn/a
Meas. Tech.ChEMBL_745571 (CHEMBL1775888)
Ki 120±n/a nM
Citation Lozama, ACunningham, CWCaspers, MJDouglas, JTDersch, CMRothman, RBPrisinzano, TE Opioid receptor probes derived from cycloaddition of the hallucinogen natural product salvinorin A. J Nat Prod74:718-26 (2011) 
 
Kappa-type opioid receptor
Name:Kappa-type opioid receptor
Type:G Protein-Coupled Receptor (GPCR)
Mol. Mass.:42648.76
Organism:Homo sapiens (Human)
Description:P41145
Residue:380
BDBM50343252
NameBDBM50343252
Synonyms:CHEMBL1773747 | Diethyl 5-((2S,4aR,6aR,7R,9S,10aS,10bR)-9-acetoxy-7-(methoxycarbonyl)-6a,10b-dimethyl-4,10-dioxododecahydro-1H-benzo[f]isochromen-2-yl)-7-oxabicyclo[2.2.1]hepta-2,5-diene-2,3-dicarboxylate
TypeSmall organic molecule
Emp. Form.C31H38O12
Mol. Mass.602.6262
SMILESCCOC(=O)C1=C(C2OC1C=C2[C@@H]1C[C@@]2(C)[C@@H](CC[C@@]3(C)[C@@H](C[C@H](OC(C)=O)C(=O)[C@H]23)C(=O)OC)C(=O)O1)C(=O)OCC