Reaction Details
TargetTyrosine-protein kinase ABL1
LigandBDBM50345591
Substrate/Competitorn/a
Meas. Tech.ChEMBL_751378 (CHEMBL1785339)
IC50 50±n/a nM
Citation Thomas, MHuang, WSWen, DZhu, XWang, YMetcalf, CALiu, SChen, IRomero, JZou, DSundaramoorthi, RLi, FQi, JCai, LZhou, TCommodore, LXu, QKeats, JWang, FWardwell, SNing, YSnodgrass, JTBroudy, MIRussian, KIuliucci, JRivera, VMSawyer, TKDalgarno, DCClackson, TShakespeare, WC Discovery of 5-(arenethynyl) hetero-monocyclic derivatives as potent inhibitors of BCR-ABL including the T315I gatekeeper mutant. Bioorg Med Chem Lett21:3743-8 (2011) 
 
Tyrosine-protein kinase ABL1
Name:Tyrosine-protein kinase ABL1
Type:Enzyme
Mol. Mass.:122897.30
Organism:Homo sapiens (Human)
Description:P00519
Residue:1130
BDBM50345591
NameBDBM50345591
Synonyms:3-((2-(cyclopropylamino)pyrimidin-5-yl)ethynyl)-4-methyl-N-(4-((4-methylpiperazin-1-yl)methyl)-3-(trifluoromethyl)phenyl)benzamide | CHEMBL1784630
TypeSmall organic molecule
Emp. Form.C30H31F3N6O
Mol. Mass.548.6019
SMILESCN1CCN(Cc2ccc(NC(=O)c3ccc(C)c(c3)C#Cc3cnc(NC4CC4)nc3)cc2C(F)(F)F)CC1