Reaction Details
TargetProtein-tyrosine kinase 2-beta
LigandBDBM50345900
Substrate/Competitorn/a
Meas. Tech.ChEMBL_749785 (CHEMBL1787945)
IC50 95±n/a nM
Citation Walker, DPZawistoski, MPMcGlynn, MALi, JCKung, DWBonnette, PCBaumann, ABuckbinder, LHouser, JABoer, JMistry, AHan, SXing, LGuzman-Perez, A Sulfoximine-substituted trifluoromethylpyrimidine analogs as inhibitors of proline-rich tyrosine kinase 2 (PYK2) show reduced hERG activity. Bioorg Med Chem Lett19:3253-8 (2009) 
 
Protein-tyrosine kinase 2-beta
Name:Protein-tyrosine kinase 2-beta
Type:Protein
Mol. Mass.:115868.80
Organism:Homo sapiens (Human)
Description:Q14289
Residue:1009
BDBM50345900
NameBDBM50345900
Synonyms:CHEMBL1783837 | N-cyclopropyl-4-(4-((1R,2R)-2-(dimethylamino)cyclopentylamino)-5-(trifluoromethyl)pyrimidin-2-ylamino)benzenesulfonamide
TypeSmall organic molecule
Emp. Form.C21H27F3N6O2S
Mol. Mass.484.538
SMILESCN(C)[C@@H]1CCC[C@H]1Nc1nc(Nc2ccc(cc2)S(=O)(=O)NC2CC2)ncc1C(F)(F)F