Reaction Details
TargetFocal adhesion kinase 1
LigandBDBM50418579
Substrate/Competitorn/a
Meas. Tech.ChEMBL_749786 (CHEMBL1787946)
IC50 2400±n/a nM
Citation Walker, DPZawistoski, MPMcGlynn, MALi, JCKung, DWBonnette, PCBaumann, ABuckbinder, LHouser, JABoer, JMistry, AHan, SXing, LGuzman-Perez, A Sulfoximine-substituted trifluoromethylpyrimidine analogs as inhibitors of proline-rich tyrosine kinase 2 (PYK2) show reduced hERG activity. Bioorg Med Chem Lett19:3253-8 (2009) 
 
Focal adhesion kinase 1
Name:Focal adhesion kinase 1
Type:Tyrosine-protein kinase
Mol. Mass.:119233.17
Organism:Homo sapiens (Human)
Description:Q05397
Residue:1052
BDBM50418579
NameBDBM50418579
Synonyms:CHEMBL2029181
TypeSmall organic molecule
Emp. Form.C21H29F3N6OS
Mol. Mass.470.555
SMILESCCNS(=C)(=O)c1ccc(Nc2ncc(c(N[C@@H]3CCC[C@H]3N(C)C)n2)C(F)(F)F)cc1