Reaction Details
TargetCholinesterase
LigandBDBM50346409
Substrate/Competitorn/a
Meas. Tech.ChEMBL_751135 (CHEMBL1787217)
IC50 1200±n/a nM
Citation Tasso, BCatto, MNicolotti, ONovelli, FTonelli, MGiangreco, IPisani, LSparatore, ABoido, VCarotti, ASparatore, F Quinolizidinyl derivatives of bi- and tricyclic systems as potent inhibitors of acetyl- and butyrylcholinesterase with potential in Alzheimer's disease. Eur J Med Chem46:2170-84 (2011) 
 
Cholinesterase
Name:Cholinesterase
Type:Enzyme
Mol. Mass.:65643.35
Organism:Equus caballus (Horse)
Description:P81908
Residue:574
BDBM50346409
NameBDBM50346409
Synonyms:1-(2-methoxy-10H-phenothiazin-10-yl)-2-(((1R,9aR)-octahydro-1H-quinolizin-1-yl)methylthio)ethanone | CHEMBL1782734
TypeSmall organic molecule
Emp. Form.C25H30N2O2S2
Mol. Mass.454.648
SMILESCOc1ccc2Sc3ccccc3N(C(=O)CSC[C@@H]3CCCN4CCCC[C@H]34)c2c1