Reaction Details
TargetCholinesterase
LigandBDBM50346414
Substrate/Competitorn/a
Meas. Tech.ChEMBL_751135 (CHEMBL1787217)
IC50 860±n/a nM
Citation Tasso, BCatto, MNicolotti, ONovelli, FTonelli, MGiangreco, IPisani, LSparatore, ABoido, VCarotti, ASparatore, F Quinolizidinyl derivatives of bi- and tricyclic systems as potent inhibitors of acetyl- and butyrylcholinesterase with potential in Alzheimer's disease. Eur J Med Chem46:2170-84 (2011) 
 
Cholinesterase
Name:Cholinesterase
Type:Enzyme
Mol. Mass.:65643.35
Organism:Equus caballus (Horse)
Description:P81908
Residue:574
BDBM50346414
NameBDBM50346414
Synonyms:5-((((1R,9aR)-octahydro-1H-quinolizin-1-yl)methylthio)methyl)-10,11-dihydro-5H-dibenzo[b,f]azepine | CHEMBL1782739
TypeSmall organic molecule
Emp. Form.C25H32N2S
Mol. Mass.392.6
SMILESC(SCN1c2ccccc2CCc2ccccc12)[C@@H]1CCCN2CCCC[C@H]12