Reaction Details
TargetCholinesterase
LigandBDBM50346415
Substrate/Competitorn/a
Meas. Tech.ChEMBL_751135 (CHEMBL1787217)
IC50 870±n/a nM
Citation Tasso, BCatto, MNicolotti, ONovelli, FTonelli, MGiangreco, IPisani, LSparatore, ABoido, VCarotti, ASparatore, F Quinolizidinyl derivatives of bi- and tricyclic systems as potent inhibitors of acetyl- and butyrylcholinesterase with potential in Alzheimer's disease. Eur J Med Chem46:2170-84 (2011) 
 
Cholinesterase
Name:Cholinesterase
Type:Enzyme
Mol. Mass.:65643.35
Organism:Equus caballus (Horse)
Description:P81908
Residue:574
BDBM50346415
NameBDBM50346415
Synonyms:6-chloro-2-methoxy-N-(((1S,9aR)-octahydro-1H-quinolizin-1-yl)methyl)acridin-9-amine | CHEMBL1782741
TypeSmall organic molecule
Emp. Form.C24H28ClN3O
Mol. Mass.409.952
SMILESCOc1ccc2nc3cc(Cl)ccc3c(NC[C@@H]3CCCN4CCCC[C@H]34)c2c1