Reaction Details
TargetCholinesterase
LigandBDBM8958
Substrate/Competitorn/a
Meas. Tech.ChEMBL_751135 (CHEMBL1787217)
IC50 720±n/a nM
Citation Tasso, BCatto, MNicolotti, ONovelli, FTonelli, MGiangreco, IPisani, LSparatore, ABoido, VCarotti, ASparatore, F Quinolizidinyl derivatives of bi- and tricyclic systems as potent inhibitors of acetyl- and butyrylcholinesterase with potential in Alzheimer's disease. Eur J Med Chem46:2170-84 (2011) 
 
Cholinesterase
Name:Cholinesterase
Type:Enzyme
Mol. Mass.:65643.35
Organism:Equus caballus (Horse)
Description:P81908
Residue:574
BDBM8958
NameBDBM8958
Synonyms:10-(2-diethylaminopropyl)phenothiazine CHEMBL1206 diethyl[1-(10H-phenothiazin-10-yl)propan-2-yl]amine
TypeSmall organic molecule
Emp. Form.C19H24N2S
Mol. Mass.312.472
SMILESCCN(CC)C(C)CN1c2ccccc2Sc2ccccc12