Reaction Details
TargetCholinesterase
LigandBDBM50346422
Substrate/Competitorn/a
Meas. Tech.ChEMBL_751135 (CHEMBL1787217)
IC50 230±n/a nM
Citation Tasso, BCatto, MNicolotti, ONovelli, FTonelli, MGiangreco, IPisani, LSparatore, ABoido, VCarotti, ASparatore, F Quinolizidinyl derivatives of bi- and tricyclic systems as potent inhibitors of acetyl- and butyrylcholinesterase with potential in Alzheimer's disease. Eur J Med Chem46:2170-84 (2011) 
 
Cholinesterase
Name:Cholinesterase
Type:Enzyme
Mol. Mass.:65643.35
Organism:Equus caballus (Horse)
Description:P81908
Residue:574
BDBM50346422
NameBDBM50346422
Synonyms:10-(3-(4-hydroxypiperidin-1-yl)propyl)-10H-phenothiazine-2-carbonitrile PROPERICIAZINE | periciazine
TypeSmall organic molecule
Emp. Form.C21H23N3OS
Mol. Mass.365.492
SMILESOC1CCN(CCCN2c3ccccc3Sc3ccc(cc23)C#N)CC1