Reaction Details
TargetAcetylcholinesterase
LigandBDBM50346421
Substrate/Competitorn/a
Meas. Tech.ChEMBL_751133 (CHEMBL1787070)
IC50 680±n/a nM
Citation Tasso, BCatto, MNicolotti, ONovelli, FTonelli, MGiangreco, IPisani, LSparatore, ABoido, VCarotti, ASparatore, F Quinolizidinyl derivatives of bi- and tricyclic systems as potent inhibitors of acetyl- and butyrylcholinesterase with potential in Alzheimer's disease. Eur J Med Chem46:2170-84 (2011) 
 
Acetylcholinesterase
Name:Acetylcholinesterase
Type:Enzyme
Mol. Mass.:67659.62
Organism:Bos taurus (bovine)
Description:n/a
Residue:613
BDBM50346421
NameBDBM50346421
Synonyms:6-(5-(((1R,9aR)-octahydro-1H-quinolizin-1-yl)methylthio)pentyloxy)-2H-chromen-2-one | CHEMBL1782748
TypeSmall organic molecule
Emp. Form.C24H33NO3S
Mol. Mass.415.589
SMILESO=c1ccc2cc(OCCCCCSC[C@@H]3CCCN4CCCC[C@H]34)ccc2o1