Reaction Details
TargetCholinesterase
LigandBDBM50346438
Substrate/Competitorn/a
Meas. Tech.ChEMBL_751135 (CHEMBL1787217)
IC50 930±n/a nM
Citation Tasso, BCatto, MNicolotti, ONovelli, FTonelli, MGiangreco, IPisani, LSparatore, ABoido, VCarotti, ASparatore, F Quinolizidinyl derivatives of bi- and tricyclic systems as potent inhibitors of acetyl- and butyrylcholinesterase with potential in Alzheimer's disease. Eur J Med Chem46:2170-84 (2011) 
 
Cholinesterase
Name:Cholinesterase
Type:Enzyme
Mol. Mass.:65643.35
Organism:Equus caballus (Horse)
Description:P81908
Residue:574
BDBM50346438
NameBDBM50346438
Synonyms:(1S,9aR)-1-((9H-thioxanthen-9-ylidene)methyl)octahydro-1H-quinolizine | CHEMBL1782721
TypeSmall organic molecule
Emp. Form.C23H25NS
Mol. Mass.347.516
SMILES[#6]-1-[#6]-[#6]-[#7]-2-[#6]-[#6]-[#6]-[#6@@H](\[#6]=[#6]-3\c4ccccc4-[#16]-c4ccccc-34)-[#6@H]-2-[#6]-1