Reaction Details
TargetCholinesterase
LigandBDBM50346442
Substrate/Competitorn/a
Meas. Tech.ChEMBL_751135 (CHEMBL1787217)
IC50 630±n/a nM
Citation Tasso, BCatto, MNicolotti, ONovelli, FTonelli, MGiangreco, IPisani, LSparatore, ABoido, VCarotti, ASparatore, F Quinolizidinyl derivatives of bi- and tricyclic systems as potent inhibitors of acetyl- and butyrylcholinesterase with potential in Alzheimer's disease. Eur J Med Chem46:2170-84 (2011) 
 
Cholinesterase
Name:Cholinesterase
Type:Enzyme
Mol. Mass.:65643.35
Organism:Equus caballus (Horse)
Description:P81908
Residue:574
BDBM50346442
NameBDBM50346442
Synonyms:(1S,9aR)-1-((9H-fluoren-9-yl)methyl)octahydro-1H-quinolizine | CHEMBL1782724
TypeSmall organic molecule
Emp. Form.C23H27N
Mol. Mass.317.4672
SMILESC(C1c2ccccc2-c2ccccc12)[C@@H]1CCCN2CCCC[C@H]12