Reaction Details
TargetAcetylcholinesterase
LigandBDBM10404
Substrate/Competitorn/a
Meas. Tech.ChEMBL_751130 (CHEMBL1787067)
IC50 800±n/a nM
Citation Tasso, BCatto, MNicolotti, ONovelli, FTonelli, MGiangreco, IPisani, LSparatore, ABoido, VCarotti, ASparatore, F Quinolizidinyl derivatives of bi- and tricyclic systems as potent inhibitors of acetyl- and butyrylcholinesterase with potential in Alzheimer's disease. Eur J Med Chem46:2170-84 (2011) 
 
Acetylcholinesterase
Name:Acetylcholinesterase
Type:Enzyme
Mol. Mass.:67792.70
Organism:Homo sapiens (Human)
Description:P22303
Residue:614
BDBM10404
NameBDBM10404
Synonyms:(1S,12S,14R)-9-methoxy-4-methyl-11-oxa-4-azatetracyclo[8.6.1.0^{1,12}.0^{6,17}]heptadeca-6,8,10(17),15-tetraen-14-ol GALANTAMINE HYDROBROMIDE Galanthamine Lycoremine Nivaline Reminyl US9586925, Galantamine | galantamine
TypeSmall organic molecule
Emp. Form.C17H21NO3
Mol. Mass.287.3535
SMILESCOc1ccc2CN(C)CC[C@@]34C=C[C@H](O)C[C@@H]3Oc1c24