Reaction Details
TargetAcetylcholinesterase
LigandBDBM10972
Substrate/Competitorn/a
Meas. Tech.ChEMBL_751132 (CHEMBL1787069)
IC50 5±n/a nM
Citation Tasso, BCatto, MNicolotti, ONovelli, FTonelli, MGiangreco, IPisani, LSparatore, ABoido, VCarotti, ASparatore, F Quinolizidinyl derivatives of bi- and tricyclic systems as potent inhibitors of acetyl- and butyrylcholinesterase with potential in Alzheimer's disease. Eur J Med Chem46:2170-84 (2011) 
 
Acetylcholinesterase
Name:Acetylcholinesterase
Type:Enzyme
Mol. Mass.:67792.70
Organism:Homo sapiens (Human)
Description:P22303
Residue:614
BDBM10972
NameBDBM10972
Synonyms:(3aS,8aR)-1,3a,8-trimethyl-1H,2H,3H,3aH,8H,8aH-pyrrolo[2,3-b]indol-5-yl N-heptylcarbamate Eptastigmine | Heptylphysostigmine
TypeSmall organic molecule
Emp. Form.C21H33N3O2
Mol. Mass.359.5056
SMILES[H][C@]12N(C)CC[C@@]1(C)c1cc(OC(=O)NCCCCCCC)ccc1N2C