Reaction Details
TargetAcetylcholinesterase
LigandBDBM50219206
Substrate/Competitorn/a
Meas. Tech.ChEMBL_751132 (CHEMBL1787069)
Ki 3.5±n/a nM
Citation Tasso, BCatto, MNicolotti, ONovelli, FTonelli, MGiangreco, IPisani, LSparatore, ABoido, VCarotti, ASparatore, F Quinolizidinyl derivatives of bi- and tricyclic systems as potent inhibitors of acetyl- and butyrylcholinesterase with potential in Alzheimer's disease. Eur J Med Chem46:2170-84 (2011) 
 
Acetylcholinesterase
Name:Acetylcholinesterase
Type:Enzyme
Mol. Mass.:67792.70
Organism:Homo sapiens (Human)
Description:P22303
Residue:614
BDBM50219206
NameBDBM50219206
Synonyms:Anthracen-9-yl (10H-phenothiazine-10yl) methanone, 5 anthracen-10-yl(10H-phenothiazin-10-yl)methanone
TypeSmall organic molecule
Emp. Form.C27H17NOS
Mol. Mass.403.495
SMILESO=C(N1c2ccccc2Sc2ccccc12)c1c2ccccc2cc2ccccc12