Reaction Details
TargetGlycogen phosphorylase, muscle form
LigandBDBM50346608
Substrate/Competitorn/a
Meas. Tech.ChEMBL_753234 (CHEMBL1799389)
IC50 3300±n/a nM
Citation Liang, ZZhang, LLi, LLiu, JLi, HZhang, LChen, LCheng, KZheng, MWen, XZhang, PHao, JGong, YZhang, XZhu, XChen, JLiu, HJiang, HLuo, CSun, H Identification of pentacyclic triterpenes derivatives as potent inhibitors against glycogen phosphorylase based on 3D-QSAR studies. Eur J Med Chem46:2011-21 (2011) 
 
Glycogen phosphorylase, muscle form
Name:Glycogen phosphorylase, muscle form
Type:Enzyme
Mol. Mass.:97296.32
Organism:Oryctolagus cuniculus (rabbit)
Description:Phosphorylation of Ser-15 converts phosphorylase B (unphosphorylated) to phosphorylase A.
Residue:843
BDBM50346608
NameBDBM50346608
Synonyms:CHEMBL1797139
TypeSmall organic molecule
Emp. Form.C39H53ClO4
Mol. Mass.621.289
SMILESCC1(C)CC[C@@]2(CC[C@]3(C)C(=CC[C@@H]4[C@@]5(C)CC[C@H](OC(=O)\C=C/c6ccc(Cl)cc6)C(C)(C)[C@@H]5CC[C@@]34C)[C@@H]2C1)C(O)=O