Reaction Details
TargetGlycogen phosphorylase, muscle form
LigandBDBM50346688
Substrate/Competitorn/a
Meas. Tech.ChEMBL_753234 (CHEMBL1799389)
IC50 2230±n/a nM
Citation Liang, ZZhang, LLi, LLiu, JLi, HZhang, LChen, LCheng, KZheng, MWen, XZhang, PHao, JGong, YZhang, XZhu, XChen, JLiu, HJiang, HLuo, CSun, H Identification of pentacyclic triterpenes derivatives as potent inhibitors against glycogen phosphorylase based on 3D-QSAR studies. Eur J Med Chem46:2011-21 (2011) 
 
Glycogen phosphorylase, muscle form
Name:Glycogen phosphorylase, muscle form
Type:Enzyme
Mol. Mass.:97296.32
Organism:Oryctolagus cuniculus (rabbit)
Description:Phosphorylation of Ser-15 converts phosphorylase B (unphosphorylated) to phosphorylase A.
Residue:843
BDBM50346688
NameBDBM50346688
Synonyms:CHEMBL1796878
TypeSmall organic molecule
Emp. Form.C38H56O9
Mol. Mass.656.8458
SMILESCC(=O)O[C@H]1CC[C@@]2(C)[C@@H](CC[C@]3(C)[C@@H]2CC=C2[C@@H]4CC(C)(C)CC[C@@]4(CC[C@@]32C)C(=O)OC[C@H](O)[C@H]2OC(=O)C(O)C2=O)C1(C)C