Reaction Details
TargetPhosphatidylinositol 4,5-bisphosphate 3-kinase catalytic subunit alpha isoform
LigandBDBM50347088
Substrate/Competitorn/a
Meas. Tech.ChEMBL_754108 (CHEMBL1798651)
Ki 1.5±n/a nM
Citation Staben, STSiu, MGoldsmith, ROlivero, AGDo, SBurdick, DJHeffron, TPDotson, JSutherlin, DPZhu, BYTsui, VLe, HLee, LLesnick, JLewis, CMurray, JMNonomiya, JPang, JPrior, WWSalphati, LRouge, LSampath, DSideris, SWiesmann, CWu, P Structure-based design of thienobenzoxepin inhibitors of PI3-kinase. Bioorg Med Chem Lett21:4054-8 (2011) 
 
Phosphatidylinositol 4,5-bisphosphate 3-kinase catalytic subunit alpha isoform
Name:Phosphatidylinositol 4,5-bisphosphate 3-kinase catalytic subunit alpha isoform
Type:Enzyme Subunit
Mol. Mass.:124294.87
Organism:Homo sapiens (Human)
Description:P42336
Residue:1068
BDBM50347088
NameBDBM50347088
Synonyms:CHEMBL1796274
TypeSmall organic molecule
Emp. Form.C22H19ClN2O4S
Mol. Mass.442.915
SMILESCOC(=O)Nc1ccc2-c3sc(cc3CCOc2c1)C(=O)N(C)c1ccccc1Cl