Reaction Details
TargetMitogen-activated protein kinase 14
LigandBDBM50347098
Substrate/Competitorn/a
Meas. Tech.ChEMBL_752994 (CHEMBL1798818)
IC50 6±n/a nM
Citation Selness, SRBoehm, TLWalker, JKDevadas, BDurley, RCKurumbail, RShieh, HXing, LHepperle, MRucker, PVJerome, KDBenson, AGMarrufo, LDMadsen, HMHitchcock, JOwen, TJChristie, LPromo, MAHickory, BSAlvira, ENaing, WBlevis-Bal, RDevraj, RVMessing, DSchindler, JFHirsch, JSaabye, MBonar, SWebb, EAnderson, GMonahan, JB Design, synthesis and activity of a potent, selective series of N-aryl pyridinone inhibitors of p38 kinase. Bioorg Med Chem Lett21:4059-65 (2011) 
 
Mitogen-activated protein kinase 14
Name:Mitogen-activated protein kinase 14
Type:Serine/threonine-protein kinase
Mol. Mass.:41286.76
Organism:Homo sapiens (Human)
Description:Q16539
Residue:360
BDBM50347098
NameBDBM50347098
Synonyms:CHEMBL1797201
TypeSmall organic molecule
Emp. Form.C19H13BrCl2FNO2
Mol. Mass.457.12
SMILESCc1cc(OCc2ccc(F)cc2)c(Br)c(=O)n1-c1c(Cl)cccc1Cl