Reaction Details
TargetMitogen-activated protein kinase 14
LigandBDBM50347108
Substrate/Competitorn/a
Meas. Tech.ChEMBL_752994 (CHEMBL1798818)
IC50 8±n/a nM
Citation Selness, SRBoehm, TLWalker, JKDevadas, BDurley, RCKurumbail, RShieh, HXing, LHepperle, MRucker, PVJerome, KDBenson, AGMarrufo, LDMadsen, HMHitchcock, JOwen, TJChristie, LPromo, MAHickory, BSAlvira, ENaing, WBlevis-Bal, RDevraj, RVMessing, DSchindler, JFHirsch, JSaabye, MBonar, SWebb, EAnderson, GMonahan, JB Design, synthesis and activity of a potent, selective series of N-aryl pyridinone inhibitors of p38 kinase. Bioorg Med Chem Lett21:4059-65 (2011) 
 
Mitogen-activated protein kinase 14
Name:Mitogen-activated protein kinase 14
Type:Serine/threonine-protein kinase
Mol. Mass.:41286.76
Organism:Homo sapiens (Human)
Description:Q16539
Residue:360
BDBM50347108
NameBDBM50347108
Synonyms:CHEMBL1797211
TypeSmall organic molecule
Emp. Form.C19H12ClF4NO3
Mol. Mass.413.75
SMILESOCc1cc(OCc2ccc(F)cc2F)c(Cl)c(=O)n1-c1c(F)cccc1F