Reaction Details
TargetMitogen-activated protein kinase 14
LigandBDBM50347118
Substrate/Competitorn/a
Meas. Tech.ChEMBL_752994 (CHEMBL1798818)
IC50 142±n/a nM
Citation Selness, SRBoehm, TLWalker, JKDevadas, BDurley, RCKurumbail, RShieh, HXing, LHepperle, MRucker, PVJerome, KDBenson, AGMarrufo, LDMadsen, HMHitchcock, JOwen, TJChristie, LPromo, MAHickory, BSAlvira, ENaing, WBlevis-Bal, RDevraj, RVMessing, DSchindler, JFHirsch, JSaabye, MBonar, SWebb, EAnderson, GMonahan, JB Design, synthesis and activity of a potent, selective series of N-aryl pyridinone inhibitors of p38 kinase. Bioorg Med Chem Lett21:4059-65 (2011) 
 
Mitogen-activated protein kinase 14
Name:Mitogen-activated protein kinase 14
Type:Serine/threonine-protein kinase
Mol. Mass.:41286.76
Organism:Homo sapiens (Human)
Description:Q16539
Residue:360
BDBM50347118
NameBDBM50347118
Synonyms:CHEMBL1797221
TypeSmall organic molecule
Emp. Form.C21H18BrF2N3O3
Mol. Mass.478.287
SMILESCc1cc(OCc2ccc(F)cc2F)c(Br)c(=O)n1-c1ccc(CNC(N)=O)cc1