Reaction Details
TargetBeta-lactamase
LigandBDBM50347184
Substrate/Competitorn/a
Meas. Tech.ChEMBL_754355 (CHEMBL1799221)
IC50 32±n/a nM
Citation Tan, QOgawa, AMRaghoobar, SLWisniewski, DColwell, LPark, YWYoung, KHermes, JDDininno, FPHammond, ML Thiophenyl oxime-derived phosphonates as nano-molar class C beta-lactamase inhibitors reducing MIC of imipenem against Pseudomonas aeruginosa and Acinetobacter baumannii. Bioorg Med Chem Lett21:4363-5 (2011) 
 
Beta-lactamase
Name:Beta-lactamase
Type:PROTEIN
Mol. Mass.:41306.67
Organism:Enterobacter cloacae
Description:ChEMBL_40258
Residue:381
BDBM50347184
NameBDBM50347184
Synonyms:CHEMBL1795567
TypeSmall organic molecule
Emp. Form.C15H13FN3O5PS
Mol. Mass.397.318
SMILESCO\N=C(\C(=O)NCP(O)(=O)Oc1ccc(C#N)c(F)c1)c1cccs1