Reaction Details
TargetPolyunsaturated fatty acid lipoxygenase ALOX15
LigandBDBM50347323
Substrate/Competitorn/a
Meas. Tech.ChEMBL_754315 (CHEMBL1799091)
IC50 1.5±n/a nM
Citation Ngu, KWeinstein, DSLiu, WLangevine, CCombs, DWZhuang, SChen, XMadsen, CSHarper, TWAhmad, SRobl, JA Pyrazole-based sulfonamide and sulfamides as potent inhibitors of mammalian 15-lipoxygenase. Bioorg Med Chem Lett21:4141-5 (2011) 
 
Polyunsaturated fatty acid lipoxygenase ALOX15
Name:Polyunsaturated fatty acid lipoxygenase ALOX15
Type:Enzyme
Mol. Mass.:75309.71
Organism:Oryctolagus cuniculus (rabbit)
Description:15-LO enzyme was purified from phenylhydrazine treated rabbits.
Residue:663
BDBM50347323
NameBDBM50347323
Synonyms:CHEMBL1796845
TypeSmall organic molecule
Emp. Form.C28H33N5O3S2
Mol. Mass.551.723
SMILESCOc1cccc(c1)-c1n[nH]c(c1CCNS(=O)(=O)N(C)[C@@H]1CCN(Cc2ccccc2)C1)-c1cccs1