Reaction Details
TargetPolyunsaturated fatty acid lipoxygenase ALOX15
LigandBDBM50347328
Substrate/Competitorn/a
Meas. Tech.ChEMBL_754315 (CHEMBL1799091)
IC50 2.7±n/a nM
Citation Ngu, KWeinstein, DSLiu, WLangevine, CCombs, DWZhuang, SChen, XMadsen, CSHarper, TWAhmad, SRobl, JA Pyrazole-based sulfonamide and sulfamides as potent inhibitors of mammalian 15-lipoxygenase. Bioorg Med Chem Lett21:4141-5 (2011) 
 
Polyunsaturated fatty acid lipoxygenase ALOX15
Name:Polyunsaturated fatty acid lipoxygenase ALOX15
Type:Enzyme
Mol. Mass.:75309.71
Organism:Oryctolagus cuniculus (rabbit)
Description:15-LO enzyme was purified from phenylhydrazine treated rabbits.
Residue:663
BDBM50347328
NameBDBM50347328
Synonyms:CHEMBL1796850
TypeSmall organic molecule
Emp. Form.C28H35N7O2S2
Mol. Mass.565.753
SMILESCCN([C@@H]1CCN(C1)C(C)(C)c1ccccc1)S(=O)(=O)NCCc1c(n[nH]c1-c1cccs1)-c1cnccn1