Reaction Details
TargetPolyunsaturated fatty acid lipoxygenase ALOX15
LigandBDBM50347317
Substrate/Competitorn/a
Meas. Tech.ChEMBL_754314 (CHEMBL1799090)
IC50 28±n/a nM
Citation Ngu, KWeinstein, DSLiu, WLangevine, CCombs, DWZhuang, SChen, XMadsen, CSHarper, TWAhmad, SRobl, JA Pyrazole-based sulfonamide and sulfamides as potent inhibitors of mammalian 15-lipoxygenase. Bioorg Med Chem Lett21:4141-5 (2011) 
 
Polyunsaturated fatty acid lipoxygenase ALOX15
Name:Polyunsaturated fatty acid lipoxygenase ALOX15
Type:Enzyme
Mol. Mass.:75309.71
Organism:Oryctolagus cuniculus (rabbit)
Description:15-LO enzyme was purified from phenylhydrazine treated rabbits.
Residue:663
BDBM50347317
NameBDBM50347317
Synonyms:CHEMBL1796839
TypeSmall organic molecule
Emp. Form.C26H29N3O2S2
Mol. Mass.479.657
SMILESCCCCCc1ccc(cc1)S(=O)(=O)NCCc1c(n[nH]c1-c1cccs1)-c1ccccc1