Reaction Details
TargetPolyunsaturated fatty acid lipoxygenase ALOX15
LigandBDBM50347325
Substrate/Competitorn/a
Meas. Tech.ChEMBL_754314 (CHEMBL1799090)
IC50 7±n/a nM
Citation Ngu, KWeinstein, DSLiu, WLangevine, CCombs, DWZhuang, SChen, XMadsen, CSHarper, TWAhmad, SRobl, JA Pyrazole-based sulfonamide and sulfamides as potent inhibitors of mammalian 15-lipoxygenase. Bioorg Med Chem Lett21:4141-5 (2011) 
 
Polyunsaturated fatty acid lipoxygenase ALOX15
Name:Polyunsaturated fatty acid lipoxygenase ALOX15
Type:Enzyme
Mol. Mass.:75309.71
Organism:Oryctolagus cuniculus (rabbit)
Description:15-LO enzyme was purified from phenylhydrazine treated rabbits.
Residue:663
BDBM50347325
NameBDBM50347325
Synonyms:CHEMBL1796847
TypeSmall organic molecule
Emp. Form.C25H29N7O2S2
Mol. Mass.523.673
SMILESCN([C@@H]1CCN(Cc2ccccc2)C1)S(=O)(=O)NCCc1c(n[nH]c1-c1cccs1)-c1cnccn1