Reaction Details
TargetPolyunsaturated fatty acid lipoxygenase ALOX15
LigandBDBM50347330
Substrate/Competitorn/a
Meas. Tech.ChEMBL_754315 (CHEMBL1799091)
IC50 4.2±n/a nM
Citation Ngu, KWeinstein, DSLiu, WLangevine, CCombs, DWZhuang, SChen, XMadsen, CSHarper, TWAhmad, SRobl, JA Pyrazole-based sulfonamide and sulfamides as potent inhibitors of mammalian 15-lipoxygenase. Bioorg Med Chem Lett21:4141-5 (2011) 
 
Polyunsaturated fatty acid lipoxygenase ALOX15
Name:Polyunsaturated fatty acid lipoxygenase ALOX15
Type:Enzyme
Mol. Mass.:75309.71
Organism:Oryctolagus cuniculus (rabbit)
Description:15-LO enzyme was purified from phenylhydrazine treated rabbits.
Residue:663
BDBM50347330
NameBDBM50347330
Synonyms:CHEMBL1795361
TypeSmall organic molecule
Emp. Form.C25H30N6O3S2
Mol. Mass.526.674
SMILESCN([C@@H]1CCN(Cc2ccccc2)C1)S(=O)(=O)NCCc1c(n[nH]c1-c1cccs1)-c1cc(C)on1