Reaction Details
TargetC-X-C chemokine receptor type 4
LigandBDBM50347491
Substrate/Competitorn/a
Meas. Tech.ChEMBL_754437 (CHEMBL1806025)
IC50 5.4±n/a nM
Citation Zhu, AZhan, WLiang, ZYoon, YYang, HGrossniklaus, HEXu, JRojas, MLockwood, MSnyder, JPLiotta, DCShim, H Dipyrimidine amines: a novel class of chemokine receptor type 4 antagonists with high specificity. J Med Chem53:8556-68 (2010) 
 
C-X-C chemokine receptor type 4
Name:C-X-C chemokine receptor type 4
Type:Enzyme
Mol. Mass.:39754.61
Organism:Homo sapiens (Human)
Description:P61073
Residue:352
BDBM50347491
NameBDBM50347491
Synonyms:CHEMBL1802329
TypeSmall organic molecule
Emp. Form.C26H30F4N8O2
Mol. Mass.562.5624
SMILESCCOCCN1CCN(CC1)C(=O)c1cnc(NCc2ccc(CNc3ncc(F)cn3)cc2)nc1C(F)(F)F