Reaction Details
TargetGonadotropin-releasing hormone receptor
LigandBDBM50347982
Substrate/Competitorn/a
Meas. Tech.ChEMBL_756124 (CHEMBL1804380)
IC50 0.33±n/a nM
Citation Miwa, KHitaka, TImada, TSasaki, SYoshimatsu, MKusaka, MTanaka, ANakata, DFuruya, SEndo, SHamamura, KKitazaki, T Discovery of 1-{4-[1-(2,6-difluorobenzyl)-5-[(dimethylamino)methyl]-3-(6-methoxypyridazin-3-yl)-2,4-dioxo-1,2,3,4-tetrahydrothieno[2,3-d]pyrimidin-6-yl]phenyl}-3-methoxyurea (TAK-385) as a potent, orally active, non-peptide antagonist of the human gonadotropin-releasing hormone receptor. J Med Chem54:4998-5012 (2011) 
 
Gonadotropin-releasing hormone receptor
Name:Gonadotropin-releasing hormone receptor
Type:Enzyme
Mol. Mass.:37749.45
Organism:Homo sapiens (Human)
Description:P30968
Residue:328
BDBM50347982
NameBDBM50347982
Synonyms:CHEMBL1800159
TypeSmall organic molecule
Emp. Form.C29H27F2N7O5S
Mol. Mass.623.63
SMILESCONC(=O)Nc1ccc(cc1)-c1sc2n(Cc3c(F)cccc3F)c(=O)n(-c3ccc(OC)nn3)c(=O)c2c1CN(C)C