Reaction Details
TargetGonadotropin-releasing hormone receptor
LigandBDBM50122654
Substrate/Competitorn/a
Meas. Tech.ChEMBL_756122 (CHEMBL1804378)
IC50 0.06±n/a nM
Citation Miwa, KHitaka, TImada, TSasaki, SYoshimatsu, MKusaka, MTanaka, ANakata, DFuruya, SEndo, SHamamura, KKitazaki, T Discovery of 1-{4-[1-(2,6-difluorobenzyl)-5-[(dimethylamino)methyl]-3-(6-methoxypyridazin-3-yl)-2,4-dioxo-1,2,3,4-tetrahydrothieno[2,3-d]pyrimidin-6-yl]phenyl}-3-methoxyurea (TAK-385) as a potent, orally active, non-peptide antagonist of the human gonadotropin-releasing hormone receptor. J Med Chem54:4998-5012 (2011) 
 
Gonadotropin-releasing hormone receptor
Name:Gonadotropin-releasing hormone receptor
Type:Enzyme
Mol. Mass.:37749.45
Organism:Homo sapiens (Human)
Description:P30968
Residue:328
BDBM50122654
NameBDBM50122654
Synonyms:1-(4-(1-(2,6-difluorobenzyl)-5-((benzyl(methyl)amino)methyl)-2,4-dioxo-3-phenyl-1,2,3,4-tetrahydrothieno[2,3-d]pyrimidin-6-yl)phenyl)-3-methoxyurea CHEMBL22055 TAK-013 | sufugolix
TypeSmall organic molecule
Emp. Form.C36H31F2N5O4S
Mol. Mass.667.724
SMILESCONC(=O)Nc1ccc(cc1)-c1sc2n(Cc3c(F)cccc3F)c(=O)n(-c3ccccc3)c(=O)c2c1CN(C)Cc1ccccc1