Reaction Details
TargetGonadotropin-releasing hormone receptor
LigandBDBM50347992
Substrate/Competitorn/a
Meas. Tech.ChEMBL_756120 (CHEMBL1804376)
IC50 0.2±n/a nM
Citation Miwa, KHitaka, TImada, TSasaki, SYoshimatsu, MKusaka, MTanaka, ANakata, DFuruya, SEndo, SHamamura, KKitazaki, T Discovery of 1-{4-[1-(2,6-difluorobenzyl)-5-[(dimethylamino)methyl]-3-(6-methoxypyridazin-3-yl)-2,4-dioxo-1,2,3,4-tetrahydrothieno[2,3-d]pyrimidin-6-yl]phenyl}-3-methoxyurea (TAK-385) as a potent, orally active, non-peptide antagonist of the human gonadotropin-releasing hormone receptor. J Med Chem54:4998-5012 (2011) 
 
Gonadotropin-releasing hormone receptor
Name:Gonadotropin-releasing hormone receptor
Type:Enzyme
Mol. Mass.:37749.45
Organism:Homo sapiens (Human)
Description:P30968
Residue:328
BDBM50347992
NameBDBM50347992
Synonyms:CHEMBL1800669
TypeSmall organic molecule
Emp. Form.C29H33F2N5O6S
Mol. Mass.617.664
SMILESCOCCN(C)Cc1c(sc2n(Cc3c(F)cccc3F)c(=O)n(CCOC)c(=O)c12)-c1ccc(NC(=O)NOC)cc1