Reaction Details
TargetHepatocyte growth factor receptor
LigandBDBM50348981
Substrate/Competitorn/a
Meas. Tech.ChEMBL_758705 (CHEMBL1810157)
IC50>40000±n/a nM
Citation Slavish, PJPrice, JEJiang, QCui, XMorris, SWWebb, TR Synthesis of an aryloxy oxo pyrimidinone library that displays ALK-selective inhibition. Bioorg Med Chem Lett21:4592-6 (2011) 
 
Hepatocyte growth factor receptor
Name:Hepatocyte growth factor receptor
Type:Protein
Mol. Mass.:155559.73
Organism:Homo sapiens (Human)
Description:P08581
Residue:1390
BDBM50348981
NameBDBM50348981
Synonyms:CHEMBL1808104
TypeSmall organic molecule
Emp. Form.C16H13ClN2O5
Mol. Mass.348.738
SMILESCOC(=O)c1cc(Cl)ccc1Oc1nc[nH]c(=O)c1C=CC(C)=O