Reaction Details
TargetDual specificity protein kinase TTK
LigandBDBM50349100
Substrate/Competitorn/a
Meas. Tech.ChEMBL_757717 (CHEMBL1809661)
IC50 140±n/a nM
Citation Caldarelli, MAngiolini, MDisingrini, TDonati, DGuanci, MNuvoloni, SPosteri, HQuartieri, FSilvagni, MColombo, R Synthesis and SAR of new pyrazolo[4,3-h]quinazoline-3-carboxamide derivatives as potent and selective MPS1 kinase inhibitors. Bioorg Med Chem Lett21:4507-11 (2011) 
 
Dual specificity protein kinase TTK
Name:Dual specificity protein kinase TTK
Type:Protein
Mol. Mass.:97086.79
Organism:Homo sapiens (Human)
Description:P33981
Residue:857
BDBM50349100
NameBDBM50349100
Synonyms:CHEMBL1808339
TypeSmall organic molecule
Emp. Form.C29H28F3N7O3
Mol. Mass.579.5729
SMILESCCc1cccc(CC)c1NC(=O)c1nn(C)c-2c1CCc1cnc(Nc3ccc(cc3OC(F)(F)F)C(N)=O)nc-21