Reaction Details
TargetAurora kinase A
LigandBDBM50349096
Substrate/Competitorn/a
Meas. Tech.ChEMBL_757718 (CHEMBL1809662)
IC50 152±n/a nM
Citation Caldarelli, MAngiolini, MDisingrini, TDonati, DGuanci, MNuvoloni, SPosteri, HQuartieri, FSilvagni, MColombo, R Synthesis and SAR of new pyrazolo[4,3-h]quinazoline-3-carboxamide derivatives as potent and selective MPS1 kinase inhibitors. Bioorg Med Chem Lett21:4507-11 (2011) 
 
Aurora kinase A
Name:Aurora kinase A
Type:Serine/threonine-protein kinase
Mol. Mass.:45830.98
Organism:Homo sapiens (Human)
Description:O14965
Residue:403
BDBM50349096
NameBDBM50349096
Synonyms:CHEMBL1808334
TypeSmall organic molecule
Emp. Form.C27H28N6O
Mol. Mass.452.5508
SMILESCCc1cccc(CC)c1NC(=O)c1nn(C)c-2c1CCc1cnc(Nc3ccccc3)nc-21