Reaction Details
TargetAurora kinase A
LigandBDBM50349105
Substrate/Competitorn/a
Meas. Tech.ChEMBL_757718 (CHEMBL1809662)
IC50 1376±n/a nM
Citation Caldarelli, MAngiolini, MDisingrini, TDonati, DGuanci, MNuvoloni, SPosteri, HQuartieri, FSilvagni, MColombo, R Synthesis and SAR of new pyrazolo[4,3-h]quinazoline-3-carboxamide derivatives as potent and selective MPS1 kinase inhibitors. Bioorg Med Chem Lett21:4507-11 (2011) 
 
Aurora kinase A
Name:Aurora kinase A
Type:Serine/threonine-protein kinase
Mol. Mass.:45830.98
Organism:Homo sapiens (Human)
Description:O14965
Residue:403
BDBM50349105
NameBDBM50349105
Synonyms:CHEMBL1808343
TypeSmall organic molecule
Emp. Form.C38H46N8O3
Mol. Mass.662.8236
SMILESCCc1cccc(CC)c1NC(=O)c1nn(C)c-2c1CCc1cnc(Nc3ccc(cc3OC)C(=O)N3CCC[C@@H]3CN3CCCC3)nc-21