Reaction Details
TargetSerine/threonine-protein kinase PLK1
LigandBDBM50349099
Substrate/Competitorn/a
Meas. Tech.ChEMBL_757720 (CHEMBL1809664)
IC50 3034±n/a nM
Citation Caldarelli, MAngiolini, MDisingrini, TDonati, DGuanci, MNuvoloni, SPosteri, HQuartieri, FSilvagni, MColombo, R Synthesis and SAR of new pyrazolo[4,3-h]quinazoline-3-carboxamide derivatives as potent and selective MPS1 kinase inhibitors. Bioorg Med Chem Lett21:4507-11 (2011) 
 
Serine/threonine-protein kinase PLK1
Name:Serine/threonine-protein kinase PLK1
Type:Serine/threonine-protein kinase
Mol. Mass.:68277.16
Organism:Homo sapiens (Human)
Description:P53350
Residue:603
BDBM50349099
NameBDBM50349099
Synonyms:CHEMBL1808338
TypeSmall organic molecule
Emp. Form.C29H31N7O3
Mol. Mass.525.6015
SMILESCCc1cccc(CC)c1NC(=O)c1nn(C)c-2c1CCc1cnc(Nc3ccc(cc3OC)C(N)=O)nc-21