Reaction Details
TargetSerine/threonine-protein kinase PLK1
LigandBDBM31538
Substrate/Competitorn/a
Meas. Tech.ChEMBL_757720 (CHEMBL1809664)
IC50>10000±n/a nM
Citation Caldarelli, MAngiolini, MDisingrini, TDonati, DGuanci, MNuvoloni, SPosteri, HQuartieri, FSilvagni, MColombo, R Synthesis and SAR of new pyrazolo[4,3-h]quinazoline-3-carboxamide derivatives as potent and selective MPS1 kinase inhibitors. Bioorg Med Chem Lett21:4507-11 (2011) 
 
Serine/threonine-protein kinase PLK1
Name:Serine/threonine-protein kinase PLK1
Type:Serine/threonine-protein kinase
Mol. Mass.:68277.16
Organism:Homo sapiens (Human)
Description:P53350
Residue:603
BDBM31538
NameBDBM31538
Synonyms:pyrazolo[4,3-h]quinazoline-3-carboxamide, 21
TypeSmall organic molecule
Emp. Form.C24H22N6O
Mol. Mass.410.4711
SMILESCn1nc(C(=O)NCc2ccccc2)c2CCc3cnc(Nc4ccccc4)nc3-c12