Reaction Details
TargetCathepsin S
LigandBDBM50098576
Substrate/Competitorn/a
Meas. Tech.ChEMBL_759683 (CHEMBL1811516)
IC50 8.3±n/a nM
Citation Kerns, JKNie, HBondinell, WWiddowson, KLYamashita, DSRahman, APodolin, PLCarpenter, DCJin, QRiflade, BDong, XNevins, NKeller, PMMitchell, LTomaszek, T Azepanone-based inhibitors of human cathepsin S: optimization of selectivity via the P2 substituent. Bioorg Med Chem Lett21:4409-15 (2011) 
 
Cathepsin S
Name:Cathepsin S
Type:Protein
Mol. Mass.:37507.38
Organism:Homo sapiens (Human)
Description:P25774
Residue:331
BDBM50098576
NameBDBM50098576
Synonyms:5-(2-MORPHOLIN-4-YLETHOXY)BENZOFURAN-2-CARBOXYLIC ACID ((S)-3-METHYL-1-{(S)-3-OXO-1-[2-(3-PYRIDIN-2-YLPHENYL)ACETYL]AZEPAN-4-YLCARBAMOYL}BUTYL)AMIDE CHEMBL284939
TypeSmall organic molecule
Emp. Form.C40H47N5O7
Mol. Mass.709.8305
SMILESCC(C)C[C@H](NC(=O)c1cc2cc(OCCN3CCOCC3)ccc2o1)C(=O)N[C@H]1CCCN(CC1=O)C(=O)Cc1cccc(c1)-c1ccccn1