Reaction Details
TargetCathepsin K
LigandBDBM50349199
Substrate/Competitorn/a
Meas. Tech.ChEMBL_759684 (CHEMBL1811517)
IC50 4.7±n/a nM
Citation Kerns, JKNie, HBondinell, WWiddowson, KLYamashita, DSRahman, APodolin, PLCarpenter, DCJin, QRiflade, BDong, XNevins, NKeller, PMMitchell, LTomaszek, T Azepanone-based inhibitors of human cathepsin S: optimization of selectivity via the P2 substituent. Bioorg Med Chem Lett21:4409-15 (2011) 
 
Cathepsin K
Name:Cathepsin K
Type:Enzyme
Mol. Mass.:36975.68
Organism:Homo sapiens (Human)
Description:P43235
Residue:329
BDBM50349199
NameBDBM50349199
Synonyms:CHEMBL1807650
TypeSmall organic molecule
Emp. Form.C24H32N4O6S
Mol. Mass.504.599
SMILESC[C@@H]1CC[C@H](NC(=O)[C@H](CC(C)(C)C)NC(=O)c2ccco2)C(=O)CN1S(=O)(=O)c1ccccn1