Reaction Details
TargetProcathepsin L
LigandBDBM50349198
Substrate/Competitorn/a
Meas. Tech.ChEMBL_759685 (CHEMBL1811518)
IC50 0.53±n/a nM
Citation Kerns, JKNie, HBondinell, WWiddowson, KLYamashita, DSRahman, APodolin, PLCarpenter, DCJin, QRiflade, BDong, XNevins, NKeller, PMMitchell, LTomaszek, T Azepanone-based inhibitors of human cathepsin S: optimization of selectivity via the P2 substituent. Bioorg Med Chem Lett21:4409-15 (2011) 
 
Procathepsin L
Name:Procathepsin L
Type:Enzyme
Mol. Mass.:37557.19
Organism:Homo sapiens (Human)
Description:Purchased from Calbiochem (San Diego, CA).
Residue:333
BDBM50349198
NameBDBM50349198
Synonyms:CHEMBL1807649
TypeSmall organic molecule
Emp. Form.C23H30N4O6S
Mol. Mass.490.573
SMILESCC(C)C[C@H](NC(=O)c1ccco1)C(=O)N[C@H]1CC[C@@H](C)N(CC1=O)S(=O)(=O)c1ccccn1