Reaction Details
TargetC-X-C chemokine receptor type 3
LigandBDBM50349679
Substrate/Competitorn/a
Meas. Tech.ChEMBL_760045 (CHEMBL1810321)
IC50 6±n/a nM
Citation Thoma, GBaenteli, RLewis, IJones, DKovarik, JStreiff, MBZerwes, HG Special ergolines efficiently inhibit the chemokine receptor CXCR3 in blood. Bioorg Med Chem Lett21:4745-9 (2011) 
 
C-X-C chemokine receptor type 3
Name:C-X-C chemokine receptor type 3
Type:PROTEIN
Mol. Mass.:41020.84
Organism:Mus musculus
Description:ChEMBL_560734
Residue:367
BDBM50349679
NameBDBM50349679
Synonyms:CHEMBL1809000
TypeSmall organic molecule
Emp. Form.C27H28N4O2
Mol. Mass.440.5368
SMILESO=C(Nc1ccccc1)N1C[C@@H](C=C2[C@H]1Cc1c[nH]c3cccc2c13)C(=O)N1CCCCC1