Reaction Details
TargetC-X-C chemokine receptor type 3
LigandBDBM50349673
Substrate/Competitorn/a
Meas. Tech.ChEMBL_760045 (CHEMBL1810321)
IC50 2±n/a nM
Citation Thoma, GBaenteli, RLewis, IJones, DKovarik, JStreiff, MBZerwes, HG Special ergolines efficiently inhibit the chemokine receptor CXCR3 in blood. Bioorg Med Chem Lett21:4745-9 (2011) 
 
C-X-C chemokine receptor type 3
Name:C-X-C chemokine receptor type 3
Type:PROTEIN
Mol. Mass.:41020.84
Organism:Mus musculus
Description:ChEMBL_560734
Residue:367
BDBM50349673
NameBDBM50349673
Synonyms:CHEMBL1809039
TypeSmall organic molecule
Emp. Form.C30H35N5O2
Mol. Mass.497.6312
SMILESCN(C)CCn1cc2C[C@H]3N(C[C@@H](C=C3c3cccc1c23)C(=O)N1CCCC1)C(=O)Nc1ccccc1