Reaction Details
TargetC-X-C chemokine receptor type 3
LigandBDBM50349676
Substrate/Competitorn/a
Meas. Tech.ChEMBL_760045 (CHEMBL1810321)
IC50 3±n/a nM
Citation Thoma, GBaenteli, RLewis, IJones, DKovarik, JStreiff, MBZerwes, HG Special ergolines efficiently inhibit the chemokine receptor CXCR3 in blood. Bioorg Med Chem Lett21:4745-9 (2011) 
 
C-X-C chemokine receptor type 3
Name:C-X-C chemokine receptor type 3
Type:PROTEIN
Mol. Mass.:41020.84
Organism:Mus musculus
Description:ChEMBL_560734
Residue:367
BDBM50349676
NameBDBM50349676
Synonyms:CHEMBL1809042
TypeSmall organic molecule
Emp. Form.C33H40N6O2
Mol. Mass.552.7097
SMILESCN1CCN(CCn2cc3C[C@H]4N(C[C@@H](C=C4c4cccc2c34)C(=O)N2CCCC2)C(=O)Nc2ccccc2)CC1