Reaction Details
TargetC-X-C chemokine receptor type 3
LigandBDBM50349677
Substrate/Competitorn/a
Meas. Tech.ChEMBL_760045 (CHEMBL1810321)
IC50 5±n/a nM
Citation Thoma, GBaenteli, RLewis, IJones, DKovarik, JStreiff, MBZerwes, HG Special ergolines efficiently inhibit the chemokine receptor CXCR3 in blood. Bioorg Med Chem Lett21:4745-9 (2011) 
 
C-X-C chemokine receptor type 3
Name:C-X-C chemokine receptor type 3
Type:PROTEIN
Mol. Mass.:41020.84
Organism:Mus musculus
Description:ChEMBL_560734
Residue:367
BDBM50349677
NameBDBM50349677
Synonyms:CHEMBL1809043
TypeSmall organic molecule
Emp. Form.C32H37N5O3
Mol. Mass.539.6679
SMILESO=C(Nc1ccccc1)N1C[C@@H](C=C2[C@H]1Cc1cn(CCN3CCOCC3)c3cccc2c13)C(=O)N1CCCC1